{"text_format":"1","workbook":"xlsx","n_sheets":10,"sheets":["Primary","Summary (EN & FR)","Monthly printout","DEMO-data entry"," Directions-English"," Directions-Francais","Hip-only-EN (12 wks enr IP)","Non-hip, non-spine-EN(6wks enr)","Criteria Calculations","Menu dropdown options"],"not_rendered":{"charts":2,"images":0,"macros":1,"external_links":1,"defined_names":28,"comments":4,"pivot_tables":0},"unopened":[],"bounds":{"document_bytes":16777216,"sheet_cells":100000,"rows_first":2000,"rows_last":500,"rows_between":2000,"halvings":0,"cell_chars":16384,"cell_head_chars":4096},"cells_cut":0,"cells_raw":0,"read":"whole","date_system":"1900"}

{"sheet":"Primary","index":0,"n_rows":995,"n_cols":47,"rows_kept":995,"cut":false,"hidden":false,"merged":[]}
["Number/ Nombre","Name/Nom","DOB/DON    yyyy/mm/dd","Provincial health card number/  numéro de carte santé","Family Doctor (PHC)/ médecin de famille","Date of Initial/ première FLS visit(e) yyyy/mm/dd","Sex(e)","Living Status/ statut de vie","Date of/de Index Fracture  yyyy/mm/dd","Age at Time of Fracture/Âge au moment de la fracture","Days from fracture to first FLS visit/ jours de la fracture à la première visite","Fracture Type/ type de fracture","Patient Eligible/ admissible","Reason Patient Excluded/ raison patient exclu","Prior fragility fracture after age 40/Fracture de fragilité préalable après 40 ans","Number of falls/ nombre de chutes","Current OP Tx/ traitement actue OP","Patient Adherence (pt taking Tx for over 1 yr)/ Adhérence du patient (prise de la Tx pendant plus d'un an)","Is patient at a high risk for falls?/ Le patient présente-t-il un risque élevé de chute?","Referral to Falls prev services/ Référence à des services antichute","Blood work completed/ prises de sang terminée","Spine X-rays completed/  xrays d'épine terminée","Method of fracture risk determination/ Méthode de détermination du risque de fracture","Date fracture risk completed/ date limite du risque de fracture complété yyyy/mm/dd","Time to fracture risk assessment/temps pour évaluer le risque de fractur","Time to initial treatment/ temps jusqu'au traitement initial","Fracture risk/ risque de fracture","Recommended referal to OP specialist/ Recommandation recommandée au spécialiste en OP","3-6 month follow-up/  Suivi de 3-6 mois","OP treatment\n3-6 month/ Traitement OP de 3-6 mois","Patient Adherence         3-6 month/ Adhérence du patient de 3-6 mois","Date Tx started/      date de début du traitement yyyy/mm/dd","6-9 month follow-up/ Suivi de 6-9 mois","OP treatment\n6-9 month/ Traitement OP de 6-9 mois","Patient Adherence         6-9 month/ Adhérence du patient de 6-9 mois","One year follow-up/ Suivi d'un an","OP treatment>=52 wks/ Traitement OP d'un an","Patient Adherence         1 yr/ Adhérence du patient d'in an","New fracture? patient perspective/nouvelle fracture? (perspective du patient)","New fracture?(xray report)/  nouvelle fracture? (rapport de radiographie)","Comments/Commentaires","0-8 wks follow-up/\nSuivi de 0-8 semaines","OP treatment 0-8 wks/\nTraitement OP de 0-8 semaines","Patient Adherence         0-8 wks/ Adhérence du patient de0-8 semaines","8.1-16 wks follow-up/\nSuivi de 8.1-16 semaines","OP treatment 8.1-16 wks/\nTraitement OP de 8.1-16 semaines","Patient Adherence 8.1-16 wks/ Adhérence du patient de 8.1-16 semaines"]
[1,"a","1945-08-08","132141",null,"2022-03-02","Female/Femme","Community/Communauté","2022-01-01",{"$f":"DATEDIF(C2,I2,\"y\")","v":76},{"$f":"F2-I2","v":60},"Hip/Hanche","YES/OUI",null,"NO/NON","2 +","NO/NON",null,"YES/OUI","YES/OUI",null,null,"Clinical","2022-05-04",{"$f":"IF(X2-F2>=0,X2-F2,\"\")","v":63},{"$f":"IF(AF2-I2>=0,AF2-I2,\"\")","v":151},"HIGH/ÉLEVÉ","NO/NON","Contacted/ Contacté","Oral bisphos","YES/OUI","2022-06-01",null,null,null,"Contacted/ Contacté","Oral bisphos","YES/OUI","No"]
[2,"b","1948-08-08","141241231",null,"2022-03-01","Female/Femme","Community/Communauté","2022-01-02",{"$f":"DATEDIF(C3,I3,\"y\")","v":73},{"$f":"F3-I3","v":58},"Wrist/Poignet","YES/OUI",null,"NO/NON","2 +","NO/NON",null,"YES/OUI","YES/OUI",null,null,"FRAX without BMD","2022-05-04",{"$f":"IF(X3-F3>=0,X3-F3,\"\")","v":64},{"$f":"IF(AF3-I3>=0,AF3-I3,\"\")","v":152},"HIGH/ÉLEVÉ","NO/NON","Contacted/ Contacté","Oral bisphos","NO/NON","2022-06-03","Contacted/ Contacté","Oral bisphos","YES/OUI","Contacted/ Contacté","Oral bisphos","YES/OUI","No"]
[3,"c","1940-09-10","141231214",null,"2022-03-01","Male/Homme","Community/Communauté","2022-01-03",{"$f":"DATEDIF(C4,I4,\"y\")","v":81},{"$f":"F4-I4","v":57},"Shoulder/Épaule","YES/OUI",null,"NO/NON","2 +","NO/NON",null,"YES/OUI","YES/OUI",null,null,"Clinical","2022-05-03",{"$f":"IF(X4-F4>=0,X4-F4,\"\")","v":63},152,"HIGH/ÉLEVÉ","NO/NON","Contacted/ Contacté","None/Aucun","NO/NON","2022-06-04","Contacted/ Contacté","Oral bisphos","YES/OUI","Contacted/ Contacté","Oral bisphos","YES/OUI","No"]
[4,null,null,null,null,null,null,null,null,0,0,null,null,null,null,null,null,null,null,null,null,null,null,null,{"$f":"IF(X5-F5>=0,X5-F5,\"\")","v":0},0]
[5,null,null,null,null,null,null,null,null,0,0,null,null,null,null,null,null,null,null,null,null,null,null,null,0,0]
[6,null,null,null,null,null,null,null,null,0,0,null,null,null,null,null,null,null,null,null,null,null,null,null,0,0]
[7,null,null,null,null,null,null,null,null,0,0,null,null,null,null,null,null,null,null,null,null,null,null,null,0,0]
[8,null,null,null,null,null,null,null,null,0,0,null,null,null,null,null,null,null,null,null,null,null,null,null,0,0]
[9,null,null,null,null,null,null,null,null,0,0,null,null,null,null,null,null,null,null,null,null,null,null,null,0,0]
{"$rows_left_out":986}
{"sheet":"Summary (EN & FR)","index":1,"n_rows":79,"n_cols":3,"rows_kept":79,"cut":false,"hidden":false,"merged":[]}
["CIHI data (Denominator B) Admitted hip # from database/CIHI (hospital data) ","Données de CIHI (Dénominateur B) Admission de la hanche dans la base de données/CIHI (données hospitalières)",43]
[]
["B-Demominator (CIHI data x 1.7)","B-Demominator (données de CIHI x 1.7)",{"$f":"C1*1.7","v":73.099999999999994}]
[]
["How many total enrolled patients (eligible and ineligible)?","Combien de patients inscrits au total (eligble et inéligibles)?",{"$f":"'Criteria Calculations'!B130","v":3}]
["How many total enrolled patients (eligible)?","Combien de patients inscrits (éligibles)?",{"$f":"'Criteria Calculations'!B128","v":3}]
["How many total enrolled patients (ineligible)?","Combien de patients inscrits au total (inéligibles)?",{"$f":"'Criteria Calculations'!B129","v":0}]
[]
["How many trauma?","Combien de traumatismes ?",{"$f":"COUNTIF(Primary!N2:N4780, \"Trauma/traumatique\")","v":0}]
["How many palliative care?","Combien de soins palliatifs?",{"$f":"COUNTIF(Primary!N2:N4780, \"Palliative/ Soins palliatif  \")","v":0}]
{"$rows_left_out":70}
{"sheet":"Monthly printout","index":2,"n_rows":11,"n_cols":24,"rows_kept":11,"cut":false,"hidden":false,"merged":[]}
[]
["Current date:         Date actuelle:","2019-05-10",null,null,null,null,null,null,null,null,null,null,null,null,null,null,"Patient Eligible/ admissible","3-6 month follow-up/  Suivi de 3-6 mois","OP treatment\n3-6 month/ Traitement OP de 3-6 mois","OP treatment\n6-9 month","OP treatment\n6-9 month/ Traitement OP de 6-9 mois","OP treatment\n1 yr / Traitement OP d'un an","Date of Initial/ première FLS visit(e) yyyy/mm/dd","Fracture risk/ risque de fracture"]
["(control + ;)",null,null,null,null,null,null,null,null,null,null,null,null,null,null,null,"YES/OUI",{"$f":"\"=\"","v":"="},{"$f":"\"=\"","v":"="},{"$f":"\"=\"","v":"="},"=","=",{"$f":"\"<=\"&DATE(YEAR(B2),MONTH(B2)+3,DAY(B2))","v":"<=43687"},"HIGH/ÉLEVÉ"]
[null,null,null,null,null,null,null,null,null,null,null,null,null,null,null,null,"YES/OUI","Unable to contact/ Impossible à rejoindre",{"$f":"\"=\"","v":"="},"=","=","=",{"$f":"\"<=\"&DATE(YEAR(B2),MONTH(B2)+3,DAY(B2))","v":"<=43687"},"HIGH/ÉLEVÉ"]
[null,null,null,null,null,null,null,null,null,null,null,null,null,null,null,null,"YES/OUI",{"$f":"\"=\"","v":"="},{"$f":"\"=\"","v":"="},"Unable to contact/ Impossible à rejoindre","=","=",{"$f":"\"<=\"&DATE(YEAR(B2),MONTH(B2)+3,DAY(B2))","v":"<=43687"},"HIGH/ÉLEVÉ"]
["Names to call/Noms à appeler :",null,null,null,null,null,null,null,null,null,null,null,null,null,null,null,"YES/OUI",{"$f":"\"=\"","v":"="},"None/Aucun","=","=","=",{"$f":"\"<=\"&DATE(YEAR(B2),MONTH(B2)+3,DAY(B2))","v":"<=43687"},"HIGH/ÉLEVÉ"]
["Number/ Nombre","Name/Nom","Date of Initial/ première FLS visit(e) yyyy/mm/dd",null,null,null,null,null,null,null,null,null,null,null,null,null,"YES/OUI","Unable to contact/ Impossible à rejoindre","None/Aucun","=","=","=",{"$f":"\"<=\"&DATE(YEAR(B2),MONTH(B2)+3,DAY(B2))","v":"<=43687"},"HIGH/ÉLEVÉ"]
[null,null,null,null,null,null,null,null,null,null,null,null,null,null,null,null,"YES/OUI",{"$f":"\"=\"","v":"="},"None/Aucun","Unable to contact/ Impossible à rejoindre","=","=",{"$f":"\"<=\"&DATE(YEAR(B2),MONTH(B2)+3,DAY(B2))","v":"<=43687"},"HIGH/ÉLEVÉ"]
[null,null,null,null,null,null,null,null,null,null,null,null,null,null,null,null,"YES/OUI",{"$f":"\"=\"","v":"="},"None/Aucun","=","None/Aucun","=",{"$f":"\"<=\"&DATE(YEAR(B2),MONTH(B2)+3,DAY(B2))","v":"<=43687"},"HIGH/ÉLEVÉ"]
[null,null,null,null,null,null,null,null,null,null,null,null,null,null,null,null,"YES/OUI","Unable to contact/ Impossible à rejoindre","None/Aucun","=","None/Aucun","=",{"$f":"\"<=\"&DATE(YEAR(B2),MONTH(B2)+3,DAY(B2))","v":"<=43687"},"HIGH/ÉLEVÉ"]
{"$rows_left_out":2}
{"sheet":"DEMO-data entry","index":3,"n_rows":995,"n_cols":47,"rows_kept":995,"cut":false,"hidden":false,"merged":[]}
["Number/ Nombre","Name/Nom","DOB/DON    yyyy/mm/dd","Provincial health card number/  numéro de carte santé","Family Doctor (PHC)/ médecin de famille","Date of Initial/ première FLS visit(e) yyyy/mm/dd","Sex(e)","Living Status/ statut de vie","Date of/de Index Fracture  yyyy/mm/dd","Age at Time of Fracture/Âge au moment de la fracture","Days from fracture to first FLS visit/ jours de la fracture à la première visite","Fracture Type/ type de fracture","Patient Eligible/ admissible","Reason Patient Excluded/ raison patient exclu","Prior fragility fracture after age 40/Fracture de fragilité préalable après 40 ans","Number of falls/ nombre de chutes","Current OP Tx/ traitement actue OP","Patient Adherence (pt taking Tx for over 1 yr)/ Adhérence du patient (prise de la Tx pendant plus d'un an)","Is patient at a high risk for falls?/ Le patient présente-t-il un risque élevé de chute?","Referral to Falls prev services/ Référence à des services antichute","Blood work completed/ prises de sang terminée","Spine X-rays completed/  xrays d'épine terminée","Method of fracture risk determination/ Méthode de détermination du risque de fracture","Date fracture risk completed/ date limite du risque de fracture complété yyyy/mm/dd","Time to fracture risk assessment/temps pour évaluer le risque de fractur","Time to initial treatment/ temps jusqu'au traitement initial","Fracture risk/ risque de fracture","Recommended referal to OP specialist/ Recommandation recommandée au spécialiste en OP","3-6 month follow-up/  Suivi de 3-6 mois","OP treatment\n3-6 month/ Traitement OP de 3-6 mois","Patient Adherence         3-6 month/ Adhérence du patient de 3-6 mois","Date Tx started/      date de début du traitement yyyy/mm/dd","6-9 month follow-up/ Suivi de 6-9 mois","OP treatment\n6-9 month/ Traitement OP de 6-9 mois","Patient Adherence         6-9 month/ Adhérence du patient de 6-9 mois","One year follow-up/ Suivi d'un an","OP treatment>=52 wks/ Traitement OP d'un an","Patient Adherence         1 yr/ Adhérence du patient d'in an","New fracture? patient perspective/nouvelle fracture? (perspective du patient)","New fracture?(xray report)/  nouvelle fracture? (rapport de radiographie)","Comments/Commentaires","0-8 wks follow-up/\nSuivi de 0-8 semaines","OP treatment 0-8 wks/\nTraitement OP de 0-8 semaines","Patient Adherence         0-8 wks/ Adhérence du patient de0-8 semaines","8.1-16 wks follow-up/\nSuivi de 8.1-16 semaines","OP treatment 8.1-16 wks/\nTraitement OP de 8.1-16 semaines","Patient Adherence 8.1-16 wks/ Adhérence du patient de 8.1-16 semaines"]
[1,"Happy First patient","1966-12-01",null,null,"2020-10-10","Female/Femme",null,"2020-09-09",{"$f":"DATEDIF(C2,I2,\"y\")","v":53},{"$f":"F2-I2","v":31},"Wrist/Poignet","YES/OUI",null,"NO/NON",null,null,null,null,null,null,null,null,"2020-12-01",{"$f":"IF(X2-F2>=0,X2-F2,\"\")","v":52},{"$f":"IF(AF2-I2>=0,AF2-I2,\"\")","v":121},"HIGH/ÉLEVÉ",null,"Contacted/ Contacté","Oral bisphos","YES/OUI","2021-01-08",null,null,null,"Contacted/ Contacté","Oral bisphos","YES/OUI","No","No"]
[2,"Second patient","1926-12-02",null,null,"2020-12-11","Female/Femme",null,"2020-09-10",{"$f":"DATEDIF(C3,I3,\"y\")","v":93},92,"Wrist/Poignet","NO/NON","Palliative/ Soins palliatif  ",null,null,null,null,null,null,null,null,null,null,{"$f":"IF(X3-F3>=0,X3-F3,\"\")","v":""},{"$f":"IF(AF3-I3>=0,AF3-I3,\"\")","v":""}]
[3,"Third patient","1936-12-03",null,null,"2020-02-01","Male/Homme",null,"2020-01-11",{"$f":"DATEDIF(C4,I4,\"y\")","v":83},21,"Pelvis/Bassin","YES/OUI",null,"NO/NON",null,"NO/NON",null,null,null,null,null,null,"2020-12-03",306,"","LOW/FAIBLE",null,null,null,null,null,"Deceased"]
[4,"Fourth patient","1946-12-04",null,null,"2020-10-13","Male/Homme",null,"2020-01-12",73,275,"Hip/Hanche","YES/OUI",null,null,null,"YES/OUI","YES/OUI","NO/NON","NO/NON","NO/NON",null,null,"2020-12-04",{"$f":"IF(X5-F5>=0,X5-F5,\"\")","v":52},368,"HIGH/ÉLEVÉ",null,null,null,null,"2021-01-14"]
[5,null,null,null,null,null,null,null,null,0,0,null,null,null,null,null,null,null,null,null,null,null,null,null,{"$f":"IF(X6-F6>=0,X6-F6,\"\")","v":0},0]
[6,null,null,null,null,null,null,null,null,0,0,null,null,null,null,null,null,null,null,null,null,null,null,null,{"$f":"IF(X7-F7>=0,X7-F7,\"\")","v":0},0]
[7,null,null,null,null,null,null,null,null,0,0,null,null,null,null,null,null,null,null,null,null,null,null,null,{"$f":"IF(X8-F8>=0,X8-F8,\"\")","v":0},0]
[8,null,null,null,null,null,null,null,null,0,0,null,null,null,null,null,null,null,null,null,null,null,null,null,{"$f":"IF(X9-F9>=0,X9-F9,\"\")","v":0},0]
[9,null,null,null,null,null,null,null,null,0,{"$f":"F10-I10","v":0},null,null,null,null,null,null,null,null,null,null,null,null,null,{"$f":"IF(X10-F10>=0,X10-F10,\"\")","v":0},0]
{"$rows_left_out":986}
{"sheet":" Directions-English","index":4,"n_rows":42,"n_cols":2,"rows_kept":42,"cut":false,"hidden":false,"merged":[]}
[]
["To get rid of Demo data:","Just go to DEMO tab delete, right click and hit delete "]
[]
["To hide columns or rows you do not want to see","Just click to highlight the entire row or column, right click and select \"Hide\""]
[]
["Changing headers:","If the header is purple or orange, do not change the header title as that risks affecting the formulas. It is better to simply insert a column with the header you prefer and hide the columns you don't want to see"]
[]
["Explanation of color coded cells in headings:","Any of these columns, if you do not wish to seeall in your spreadsheet, can be hidden by simply clicking on the header cell (ensure  you click on the letter above the header so as to activate the whole column), right click and then choose \"Hide\" in the drop down menu-a spacer will indicate that there is a hidden column in that space. To unhide a column that was previously hidden, go to the letter above the header to find the spacer and click \"Unhide\".  "]
[null,"These columns contain important data so as to measure OC's key performance indicators (KPIs)"]
[null,"These columns contain dates so should remain"]
{"$rows_left_out":33}
{"sheet":" Directions-Francais","index":5,"n_rows":42,"n_cols":2,"rows_kept":42,"cut":false,"hidden":false,"merged":[]}
[]
["Pour se débarrasser des données de test :","Il suffit de mettre en évidence les colums B à I, de la ligne 2 et appuyez sur supprimer, en utilisant la clé de suppression"]
[]
["Pour masquer des colonnes ou des lignes que vous ne voulez pas voir:","Il suffit de cliquer pour mettre en évidence toute la ligne ou la colonne, cliquez à droite et sélectionnez \"Masquer\" (Hide)"]
[]
["Changement d'en-tête :","Si l'en-tête est violet ou orange, ne modifiez pas le titre de l'en-tête car cela risque d'affecter les formules. Il est préférable d'insérer simplement une colonne avec l'en-tête que vous préférez et de cacher les colonnes que vous ne voulez pas voir"]
[]
["Explication des cellules codées par couleur dans les titres :","L'une de ces colonnes, si vous ne souhaitez pas tout voir dans votre feuille de calcul, peut être cachée en cliquant simplement sur la cellule d'en-tête (assurez-vous de cliquer sur la lettre au-dessus de l'en-tête afin d'activer toute la colonne), cliquez à droite et ensuite choisir \"Hide\" dans le menu déroulant-un espace r indiquera qu'il y a une colonne cachée dans cet espace. Pour démasquer une colonne qui était auparavant cachée, allez à la lettre au-dessus de l'en-tête pour trouver l'espaceur et cliquez sur \"Unhide\".  "]
[null,"Ces colonnes contiennent des données importantes afin de mesurer les principaux indicateurs de performance (KPI) d'OC"]
[null,"Ces colonnes contiennent des dates et doivent donc rester"]
{"$rows_left_out":33}
{"sheet":"Hip-only-EN (12 wks enr IP)","index":6,"n_rows":32,"n_cols":2,"rows_kept":32,"cut":false,"hidden":false,"merged":[]}
["CIHI data (Denominator B) Admitted hip # from database/CIHI (hospital data) ",43]
[]
["B-Demominator (CIHI data x 1.7).",{"$f":"B1*1.7","v":73.099999999999994}]
[]
[]
["How many trauma?",{"$f":"COUNTIF(Primary!N2:N4780, \"Trauma\")","v":0}]
["How many palliative care?",{"$f":"COUNTIF(Primary!N2:N4780, \"Palliative care\")","v":0}]
["How many patient declined?",{"$f":"COUNTIF(Primary!N2:N4780, \"Patient declined\")","v":0}]
["How many No family doc (for initial fracture)?",{"$f":"COUNTIF(Primary!N2:N4780, \"No family doc\")","v":0}]
["How many referred to OP Specialist (for initial fracture)?",{"$f":"COUNTIF(Primary!N2:N4780, \"OP Specialist\")","v":0}]
{"$rows_left_out":23}
{"sheet":"Non-hip, non-spine-EN(6wks enr)","index":7,"n_rows":41,"n_cols":2,"rows_kept":41,"cut":false,"hidden":false,"merged":[]}
["CIHI data (Denominator B) Admitted hip # from database/CIHI (hospital data) ",43]
[]
["B-Demominator (CIHI data x 1.7)",{"$f":"B1*1.7","v":73.099999999999994}]
[]
[]
["How many trauma?",{"$f":"COUNTIF(Primary!N2:N4780, \"Trauma\")","v":0}]
["How many palliative care?",{"$f":"COUNTIF(Primary!N2:N4780, \"Palliative care\")","v":0}]
["How many patient declined?",{"$f":"COUNTIF(Primary!N2:N4780, \"Patient declined\")","v":0}]
["How many No family doc (for initial fracture)?",{"$f":"COUNTIF(Primary!N2:N4780, \"No family doc\")","v":0}]
["How many referred to OP Specialist (for initial fracture)?",{"$f":"COUNTIF(Primary!N2:N4780, \"OP Specialist\")","v":0}]
{"$rows_left_out":32}
{"sheet":"Criteria Calculations","index":8,"n_rows":255,"n_cols":21,"rows_kept":255,"cut":false,"hidden":false,"merged":[]}
[null,null,null,"All",null,null,null,null,null,"3-6 Months",null,null,null,"6-9 Months",null,null,null,"1 Year"]
["Criteria & Numbers:",null,null,"Patient Eligible/ admissible","Fracture risk/ risque de fracture","OP treatment\n3-6 month/ Traitement OP de 3-6 mois","OP treatment\n6-9 month/ Traitement OP de 6-9 mois","OP treatment>=52 wks/ Traitement OP d'un an",null,"Patient Eligible/ admissible","Fracture risk/ risque de fracture","OP treatment\n3-6 month/ Traitement OP de 3-6 mois",null,"Patient Eligible/ admissible","Fracture risk/ risque de fracture","OP treatment\n6-9 month/ Traitement OP de 6-9 mois",null,"Patient Eligible/ admissible","Fracture risk/ risque de fracture","OP treatment>=52 wks/ Traitement OP d'un an"]
["if yes patient is on meds at either 3, 6 or 12 mos",{"$f":"DCOUNTA(DB,\"Number/ Nombre\",D2:H20)","v":3},null,"YES/OUI","HIGH/ÉLEVÉ","Oral bisphos",null,null,null,"YES/OUI","HIGH/ÉLEVÉ","Oral bisphos",null,"YES/OUI","HIGH/ÉLEVÉ","Oral bisphos",null,"YES/OUI","HIGH/ÉLEVÉ","Oral bisphos"]
["3-6 months",{"$f":"DCOUNTA(DB,\"Number/ Nombre\",J2:L8)","v":2},null,"YES/OUI","HIGH/ÉLEVÉ",null,"Oral bisphos",null,null,"YES/OUI","HIGH/ÉLEVÉ","Zoledronic",null,"YES/OUI","HIGH/ÉLEVÉ","Zoledronic",null,"YES/OUI","HIGH/ÉLEVÉ","Zoledronic"]
["6-9 months",{"$f":"DCOUNTA(DB,\"Number/ Nombre\",N2:P8)","v":2},null,"YES/OUI","HIGH/ÉLEVÉ",null,null,"Oral bisphos",null,"YES/OUI","HIGH/ÉLEVÉ","Prolia",null,"YES/OUI","HIGH/ÉLEVÉ","Prolia",null,"YES/OUI","HIGH/ÉLEVÉ","Prolia"]
["1 Year",{"$f":"DCOUNTA(DB,\"Number/ Nombre\",R2:T8)","v":3},null,"YES/OUI","HIGH/ÉLEVÉ","Zoledronic",null,null,null,"YES/OUI","HIGH/ÉLEVÉ","Forteo",null,"YES/OUI","HIGH/ÉLEVÉ","Forteo",null,"YES/OUI","HIGH/ÉLEVÉ","Forteo"]
[null,null,null,"YES/OUI","HIGH/ÉLEVÉ",null,"Zoledronic",null,null,"YES/OUI","HIGH/ÉLEVÉ","Estrogen",null,"YES/OUI","HIGH/ÉLEVÉ","Estrogen",null,"YES/OUI","HIGH/ÉLEVÉ","Estrogen"]
[null,null,null,"YES/OUI","HIGH/ÉLEVÉ",null,null,"Zoledronic",null,"YES/OUI","HIGH/ÉLEVÉ","Raloxifene",null,"YES/OUI","HIGH/ÉLEVÉ","Raloxifene",null,"YES/OUI","HIGH/ÉLEVÉ","Raloxifene"]
[null,null,null,"YES/OUI","HIGH/ÉLEVÉ","Prolia"]
[null,null,null,"YES/OUI","HIGH/ÉLEVÉ",null,"Prolia"]
{"$rows_left_out":246}
{"sheet":"Menu dropdown options","index":9,"n_rows":46,"n_cols":18,"rows_kept":46,"cut":false,"hidden":false,"merged":[]}
["Female/Femme"]
["Male/Homme"]
[null,null,null,null,null,"Hip/Hanche",null,"Patient declined/Refus du patient",null,null,"Clinical",null,null,null,null,null,null,"January"]
[null,null,null,null,null,"Spine/Colonne vertébrale",null,"Non-osteoporotic fracture/ Fracture non-ostéoporotique",null,null,"FRAX without BMD",null,null,null,null,null,null,"February"]
[null,null,"Community/Communauté",null,null,"Wrist/Poignet",null,"Palliative/ Soins palliatif  ",null,null,"FRAX BMD + spine",null,null,"Contacted/ Contacté",null,null,null,"March"]
[null,null,"LTC/CHSLD ou Soins prolongés",null,null,"Shoulder/Épaule",null,"Trauma/traumatique",null,null,"FRAX BMD no spine",null,null,"Unable to contact/ Impossible à rejoindre",null,null,null,"April"]
[null,null,"Assisted living/Aide à domicile",null,null,"Pelvis/Bassin",null,"OP specialist/ Spécialiste en ostéoporose",null,null,null,null,null,"Referrred/référé",null,null,null,"May"]
[null,null,null,null,null,null,null,"No family doc/Pas de médecin de famille",null,null,null,null,null,"Deceased",null,null,null,"June"]
[null,null,null,null,null,null,null,"Deceased/ Dédédé(e )",null,null,null,"Oral bisphos",null,"Palliative",null,"Oral bisphos",null,"July"]
[null,null,"YES/OUI",null,null,null,null,"Wrong bone/Mauvais os",null,null,null,"Zoledronic",null,"Pt refuses F/U",null,"Zoledronic",null,"August"]
{"$rows_left_out":36}